BDBM50339475 3-{4-[(2',6'-Dimethylbiphenyl-3-yl)methoxy]phenyl}butanoic Acid::CHEMBL1688472
SMILES CC(CC(O)=O)c1ccc(OCc2cccc(c2)-c2c(C)cccc2C)cc1
InChI Key InChIKey=BBONBXQNPVADJZ-UHFFFAOYSA-N
Data  1 EC50
  Tab Delimited (TSV)   2D SDfile   Computed 3D by Vconf -m prep SDfile
Find this compound or compounds like it in BindingDB:
Activity Spreadsheet -- Enzyme Inhibition Constant Data from BindingDB
Found 1 hit for monomerid = 50339475
TargetFree fatty acid receptor 1(Homo sapiens (Human))
Takeda Pharmaceutical
Curated by ChEMBL
LigandPNGBDBM50339475(3-{4-[(2',6'-Dimethylbiphenyl-3-yl)methoxy]phenyl}...)
Affinity DataEC50:  32nM. Assay description: Agonist activity against human GPR40 expressed in CHO cells assessed as increase in intracellular calcium level by FLIPR assay in presence of 0.1% BS...
In DepthDetails ArticlePubMed